{"text_format":"1","workbook":"xlsx","n_sheets":7,"sheets":["APROV 1","Gráfica APROV 1","APROV 2 y 3","Gráfica APROV 2 Y 3","Gráfica Promedios Finales","MATRICULA","NORMALIDAD MÍNIMA"],"not_rendered":{"charts":10,"images":0,"macros":1,"external_links":0,"defined_names":1,"comments":0,"pivot_tables":0},"unopened":[],"bounds":{"document_bytes":16777216,"sheet_cells":100000,"rows_first":2000,"rows_last":500,"rows_between":2000,"halvings":0,"cell_chars":16384,"cell_head_chars":4096},"cells_cut":0,"cells_raw":0,"read":"whole","date_system":"1900"}

{"sheet":"APROV 1","index":0,"n_rows":33,"n_cols":60,"rows_kept":33,"cut":false,"hidden":false,"merged":[[32,0,34,59],[21,10,21,12],[16,8,16,9],[16,11,16,12],[16,14,16,15],[16,17,16,18],[17,8,17,9],[17,11,17,12],[17,14,17,15],[17,17,17,18],[16,47,16,49],[16,50,16,52],[18,47,18,49],[17,30,17,32],[17,33,17,35],[17,36,17,38],[18,50,18,52],[18,53,18,54],[17,39,17,40],[18,30,18,32],[18,33,18,35],[18,36,18,38],[17,53,17,54],[21,47,21,49],[0,0,0,59],[1,0,1,59],[2,0,2,59],[4,0,4,59],[6,0,6,59],[8,0,8,23],[9,0,10,0],[11,2,11,3],[12,53,12,54],[10,53,10,54],[9,1,9,3],[9,4,9,6],[9,7,9,9],[9,10,9,12],[9,13,9,15],[9,16,9,18],[9,19,9,21],[9,30,9,32],[9,33,9,35],[9,36,9,38],[10,30,10,32],[10,33,10,35],[10,36,10,38],[9,47,9,49],[11,53,11,54],[11,30,11,32],[11,33,11,35],[11,36,11,38],[13,30,13,32],[13,33,13,35],[13,36,13,38],[13,39,13,40],[13,47,13,49],[13,50,13,52],[13,53,13,54],[14,47,14,49],[12,30,12,32],[12,33,12,35],[12,36,12,38],[16,53,16,54],[15,30,15,32],[15,33,15,35],[15,36,15,38],[3,0,3,55],[14,50,14,52],[14,53,14,54],[15,47,15,49],[15,50,15,52],[15,53,15,54],[8,29,8,40],[9,46,10,46],[10,5,10,6],[9,29,10,29],[12,2,12,3],[14,2,14,3],[15,2,15,3],[11,39,11,40],[11,47,11,49],[11,50,11,52],[21,53,21,55],[20,25,21,27],[20,42,21,44],[21,46,22,46],[20,29,20,40],[21,29,22,29],[21,30,21,32],[21,33,21,35],[21,36,21,38],[21,39,21,40],[17,47,17,49],[17,50,17,52],[12,17,12,18],[14,8,14,9],[14,11,14,12],[14,14,14,15],[14,17,14,18],[21,13,21,15],[21,16,21,18],[21,19,21,21],[21,22,21,23],[20,0,20,23],[21,1,21,3],[21,0,22,0],[21,4,21,6],[21,7,21,9],[15,5,15,6],[15,39,15,40],[17,20,17,21],[18,20,18,21],[13,17,13,18],[13,20,13,21],[15,8,15,9],[21,50,21,52],[10,2,10,3],[10,8,10,9],[9,50,9,52],[10,47,10,49],[10,50,10,52],[10,39,10,40],[9,22,9,23],[12,39,12,40],[14,30,14,32],[14,33,14,35],[14,36,14,38],[14,39,14,40],[12,47,12,49],[12,50,12,52],[10,11,10,12],[11,8,11,9],[11,11,11,12],[11,14,11,15],[11,17,11,18],[12,8,12,9],[12,11,12,12],[12,14,12,15],[13,11,13,12],[13,14,13,15],[16,2,16,3],[17,2,17,3],[18,2,18,3],[11,5,11,6],[12,5,12,6],[14,5,14,6],[13,2,13,3],[13,5,13,6],[13,8,13,9],[16,5,16,6],[17,5,17,6],[18,5,18,6],[18,8,18,9],[18,11,18,12],[18,14,18,15],[18,17,18,18],[16,39,16,40],[15,20,15,21],[16,20,16,21],[8,46,8,54],[20,57,21,59],[20,46,20,55],[9,39,9,40],[9,53,9,54],[10,14,10,15],[10,17,10,18],[10,20,10,21],[15,11,15,12],[15,14,15,15],[15,17,15,18],[11,20,11,21],[12,20,12,21],[14,20,14,21],[16,30,16,32],[16,33,16,35],[16,36,16,38],[18,39,18,40]]}
["SECRETARÍA DE EDUCACIÓN PÚBLICA DEL ESTADO DE BAJA CALIFORNIA SUR"]
["DIRECCIÓN DE EDUCACIÓN SECUNDARIA"]
["CICLO ESCOLAR 2018 - 2019"]
[]
["APROVECHAMIENTO, BAJO APROVECHAMIENTO Y REPROBACIÓN"]
[]
["DIRECCIÓN: EDUCACIÓN SECUNDARIA    DIRECTOR: PROFR. RUMUALDO RAMÍREZ GUTIERRÉZ     PERIODO DE EVALUACIÓN:  PRIMERO  "]
[null,null,null,null,null,null,null,null,null,null,null,null,null,null,null,null," "]
["Promedio de Aprovechamiento de los Campos de Formación Académica",null,null,null,null,null,null,null,null,null,null,null,null,null,null,null,null,null,null,null,null,null,null,null,null,null,null,null,null,"Promedio de Aprovechamiento de las Áreas de Desarrollo Personal y Social",null,null,null,null,null,null,null,null,null,null,null,null,null,null,null,null,"Promedio de Aprovechamiento de los Clubes de Autonomía Curricular"]
["Modalidad","Lengua Materna (Español)",null,null,"Lengua Extranjera (Inglés)",null,null,"Matemáticas",null,null,"Ciencias y Tecnología Biología",null,null,"Historia",null,null,"Geografía",null,null,"Formación Cívica y Ética",null,null,"Prom. Final",null,null,null,null,null,null,"Modalidad","Artes",null,null,"Tutoría y Desarrollo Socioemocional",null,null,"Educación Física",null,null,"Prom. Final",null,null,null,null,null,null,"Modalidad","Club 1 Necesidad",null,null,"Club 2    Interés",null,null,"Prom. Final"]
[null,"ND","CALIF",null,"ND","CALIF",null,"ND","CALIF",null,"ND","CALIF",null,"ND","CALIF",null,"ND","CALIF",null,"ND","CALIF",null,"ND","CALIF",null,null,null,null,null,null,"ND",null,null,"ND",null,null,"ND",null,null,"ND",null,null,null,null,null,null,null,"ND",null,null,"ND",null,null,"ND"]
["Grales.",{"$f":"IFERROR(IF(AND(C12<=10,C12>=9.5),\"IV\",IF(AND(C12<9.5,C12>=7.5),\"III\",IF(AND(C12<7.5,C12>=6),\"II\",IF(AND(C12<6,C12>=5),\"I\",\"\")))),\"\")","v":"III"},8.4,null,{"$f":"IFERROR(IF(AND(F12<=10,F12>=9.5),\"IV\",IF(AND(F12<9.5,F12>=7.5),\"III\",IF(AND(F12<7.5,F12>=6),\"II\",IF(AND(F12<6,F12>=5),\"I\",\"\")))),\"\")","v":"III"},8.4,null,{"$f":"IFERROR(IF(AND(I12<=10,I12>=9.5),\"IV\",IF(AND(I12<9.5,I12>=7.5),\"III\",IF(AND(I12<7.5,I12>=6),\"II\",IF(AND(I12<6,I12>=5),\"I\",\"\")))),\"\")","v":"III"},8.1999999999999993,null,{"$f":"IFERROR(IF(AND(L12<=10,L12>=9.5),\"IV\",IF(AND(L12<9.5,L12>=7.5),\"III\",IF(AND(L12<7.5,L12>=6),\"II\",IF(AND(L12<6,L12>=5),\"I\",\"\")))),\"\")","v":"III"},8.4,null,{"$f":"IFERROR(IF(AND(O12<=10,O12>=9.5),\"IV\",IF(AND(O12<9.5,O12>=7.5),\"III\",IF(AND(O12<7.5,O12>=6),\"II\",IF(AND(O12<6,O12>=5),\"I\",\"\")))),\"\")","v":"III"},8.5,null,{"$f":"IFERROR(IF(AND(R12<=10,R12>=9.5),\"IV\",IF(AND(R12<9.5,R12>=7.5),\"III\",IF(AND(R12<7.5,R12>=6),\"II\",IF(AND(R12<6,R12>=5),\"I\",\"\")))),\"\")","v":"III"},8.5,null,{"$f":"IFERROR(IF(AND(U12<=10,U12>=9.5),\"IV\",IF(AND(U12<9.5,U12>=7.5),\"III\",IF(AND(U12<7.5,U12>=6),\"II\",IF(AND(U12<6,U12>=5),\"I\",\"\")))),\"\")","v":"III"},8.6,null,{"$f":"IFERROR(IF(AND(X12<=10,X12>=9.5),\"IV\",IF(AND(X12<9.5,X12>=7.5),\"III\",IF(AND(X12<7.5,X12>=6),\"II\",IF(AND(X12<6,X12>=5),\"I\",\"\")))),\"\")","v":"III"},{"$f":"ROUND(IFERROR(AVERAGE(C12,F12,I12,L12,O12,R12,U12),\"\"),1)","v":8.4},null,null,null,null,null,"Grales.","III",null,null,"III",null,null,"IV",null,null,{"$f":"Nivel(AE12,AH12,AK12)","v":"III"},null,null,null,null,null,null,"Grales.","III",null,null,"III",null,null,{"$f":"Nivel_2(AV12,AY12)","v":"III"}]
["Técs.","III",8.3000000000000007,null,"III",8.3000000000000007,null,"III",8.1999999999999993,null,"III",8.1,null,"III",8.3000000000000007,null,"III",8.3000000000000007,null,"III",8.4,null,"III",{"$f":"ROUND(IFERROR(AVERAGE(C13,F13,I13,L13,O13,R13,U13),\"\"),1)","v":8.3000000000000007},null,null,null,null,null,"Técs.","III",null,null,"IV",null,null,"IV",null,null,{"$f":"Nivel(AE13,AH13,AK13)","v":"IV"},null,null,null,null,null,null,"Técs.","III",null,null,"III",null,null,{"$f":"Nivel_2(AV13,AY13)","v":"III"}]
["Telesec.","III",8.1,null,"III",8,null,"III",8,null,"III",8.1,null,"III",8.1,null,"III",8.1,null,"III",8.4,null,"III",{"$f":"ROUND(IFERROR(AVERAGE(C14,F14,I14,L14,O14,R14,U14),\"\"),1)","v":8.1},null,null,null,null,null,"Telesec.","III",null,null,"III",null,null,"IV",null,null,"III",null,null,null,null,null,null,"Telesec.","III",null,null,"III",null,null,"III"]
[null,"",null,null,"",null,null,"",null,null,"",null,null,"",null,null,"",null,null,"",null,null,"",{"$f":"IFERROR(AVERAGE(C15,F15,I15,L15,O15,R15,U15),\"\")","v":""},null,null,null,null,null,null,null,null,null,null,null,null,null,null,null,"",null,null,null,null,null,null,null,null,null,null,null,null,null,""]
[null,"",null,null,"",null,null,"",null,null,"",null,null,"",null,null,"",null,null,"",null,null,"","",null,null,null,null,null,null,null,null,null,null,null,null,null,null,null,"",null,null,null,null,null,null,null,null,null,null,null,null,null,""]
[null,"",null,null,"",null,null,"",null,null,"",null,null,"",null,null,"",null,null,"",null,null,"","",null,null,null,null,null,null,null,null,null,null,null,null,null,null,null,"",null,null,null,null,null,null,null,null,null,null,null,null,null,""]
[null,"",null,null,"",null,null,"",null,null,"",null,null,"",null,null,"",null,null,"",null,null,"","",null,null,null,null,null,null,null,null,null,null,null,null,null,null,null,"",null,null,null,null,null,null,null,null,null,null,null,null,null,""]
["Gral.",{"$f":"IFERROR(IF(AND(C19<=10,C19>=9.5),\"IV\",IF(AND(C19<9.5,C19>=7.5),\"III\",IF(AND(C19<7.5,C19>=6),\"II\",IF(AND(C19<6,C19>=5),\"I\",\"\")))),\"\")","v":"III"},{"$f":"ROUND(IFERROR(AVERAGE(C12:D18),\"\"),1)","v":8.3000000000000007},null,{"$f":"IFERROR(IF(AND(F19<=10,F19>=9.5),\"IV\",IF(AND(F19<9.5,F19>=7.5),\"III\",IF(AND(F19<7.5,F19>=6),\"II\",IF(AND(F19<6,F19>=5),\"I\",\"\")))),\"\")","v":"III"},{"$f":"ROUND(IFERROR(AVERAGE(F12:G18),\"\"),1)","v":8.1999999999999993},null,{"$f":"IFERROR(IF(AND(I19<=10,I19>=9.5),\"IV\",IF(AND(I19<9.5,I19>=7.5),\"III\",IF(AND(I19<7.5,I19>=6),\"II\",IF(AND(I19<6,I19>=5),\"I\",\"\")))),\"\")","v":"III"},{"$f":"ROUND(IFERROR(AVERAGE(I12:J18),\"\"),1)","v":8.1},null,{"$f":"IFERROR(IF(AND(L19<=10,L19>=9.5),\"IV\",IF(AND(L19<9.5,L19>=7.5),\"III\",IF(AND(L19<7.5,L19>=6),\"II\",IF(AND(L19<6,L19>=5),\"I\",\"\")))),\"\")","v":"III"},{"$f":"ROUND(IFERROR(AVERAGE(L12:M18),\"\"),1)","v":8.1999999999999993},null,{"$f":"IFERROR(IF(AND(O19<=10,O19>=9.5),\"IV\",IF(AND(O19<9.5,O19>=7.5),\"III\",IF(AND(O19<7.5,O19>=6),\"II\",IF(AND(O19<6,O19>=5),\"I\",\"\")))),\"\")","v":"III"},{"$f":"ROUND(IFERROR(AVERAGE(O12:P18),\"\"),1)","v":8.3000000000000007},null,{"$f":"IFERROR(IF(AND(R19<=10,R19>=9.5),\"IV\",IF(AND(R19<9.5,R19>=7.5),\"III\",IF(AND(R19<7.5,R19>=6),\"II\",IF(AND(R19<6,R19>=5),\"I\",\"\")))),\"\")","v":"III"},{"$f":"ROUND(IFERROR(AVERAGE(R12:S18),\"\"),1)","v":8.3000000000000007},null,{"$f":"IFERROR(IF(AND(U19<=10,U19>=9.5),\"IV\",IF(AND(U19<9.5,U19>=7.5),\"III\",IF(AND(U19<7.5,U19>=6),\"II\",IF(AND(U19<6,U19>=5),\"I\",\"\")))),\"\")","v":"III"},{"$f":"ROUND(IFERROR(AVERAGE(U12:V18),\"\"),1)","v":8.5},null,{"$f":"IFERROR(IF(AND(X19<=10,X19>=9.5),\"IV\",IF(AND(X19<9.5,X19>=7.5),\"III\",IF(AND(X19<7.5,X19>=6),\"II\",IF(AND(X19<6,X19>=5),\"I\",\"\")))),\"\")","v":"III"},{"$f":"ROUND(IFERROR(AVERAGE(X12:X18),\"\"),1)","v":8.3000000000000007},null,null,null,null,null,"Gral.",{"$f":"total(AE12,AE13,AE14,AE15,AE16,AE17,AE18)","v":"III"},null,null,{"$f":"total(AH12,AH13,AH14,AH15,AH16,AH17,AH18)","v":"III"},null,null,{"$f":"total(AK12,AK13,AK14,AK15,AK16,AK17,AK18)","v":"IV"},null,null,{"$f":"total(AN12,AN13,AN14,AN15,AN16,AN17,AN18)","v":"III"},null,null,null,null,null,null,"Gral.",{"$f":"total(AV12,AV13,AV14,AV15,AV16,AV17,AV18)","v":"III"},null,null,{"$f":"total(AY12,AY13,AY14,AY15,AY16,AY17,AY18)","v":"III"},null,null,{"$f":"total(BB12,BB13,BB14,BB15,BB16,BB17,BB18)","v":"III"}]
[]
["Campos de Formación Académica en situación de riesgo de no acreditar",null,null,null,null,null,null,null,null,null,null,null,null,null,null,null,null,null,null,null,null,null,null,null,null,"General",null,null,null,"Áreas de Desarrollo Personal y Social en situación de riesgo de no acreditar",null,null,null,null,null,null,null,null,null,null,null,null,"General",null,null,null,"Clubes de Autonomía Curricular en situación de riesgo de no acreditar",null,null,null,null,null,null,null,null,null,null,"General"]
["Modalidad","Lengua Materna (Español)",null,null,"Lengua Extranjera (Inglés)",null,null,"Matemáticas",null,null,"Ciencias y Tecnología Biología",null,null,"Historia",null,null,"Geografía",null,null,"Formación Cívica y Ética",null,null,"Total",null,null,null,null,null,null,"Modalidad","Artes",null,null,"Tutoría y Desarrollo Socioemocional",null,null,"Educación Física",null,null,"Total",null,null,null,null,null,null,"Modalidad","Club 1 Necesidad",null,null,"Club 2    Interés",null,null,"Total"]
[null,5,6,"T",5,6,"T",5,6,"T",5,6,"T",5,6,"T",5,6,"T",5,6,"T",5,6,null,5,6,"T",null,null,"ND I","ND II","T","ND I","ND II","T","ND I","ND II","T","ND I","ND II",null,"ND I","ND II","T",null,null,"ND I","ND II","T","ND I","ND II","T","ND I","ND II","T",null,"ND I","ND II","T"]
["Grales.",216,507,{"$f":"IF(SUM(B24,C24)=0,\"\",SUM(B24,C24))","v":723},187,640,{"$f":"IF(SUM(E24,F24)=0,\"\",SUM(E24,F24))","v":827},288,676,{"$f":"IF(SUM(H24,I24)=0,\"\",SUM(H24,I24))","v":964},220,535,{"$f":"IF(SUM(K24,L24)=0,\"\",SUM(K24,L24))","v":755},232,583,{"$f":"IF(SUM(N24,O24)=0,\"\",SUM(N24,O24))","v":815},203,579,{"$f":"IF(SUM(Q24,R24)=0,\"\",SUM(Q24,R24))","v":782},178,561,{"$f":"IF(SUM(T24,U24)=0,\"\",SUM(T24,U24))","v":739},{"$f":"IF(SUM(B24,E24,H24,K24,N24,Q24,T24)=0,\"\",SUM(B24,E24,H24,K24,N24,Q24,T24))","v":1524},{"$f":"IF(SUM(C24,F24,I24,L24,O24,R24,U24)=0,\"\",SUM(C24,F24,I24,L24,O24,R24,U24))","v":4081},null,1109,2130,{"$f":"IF(SUM(Z24,AA24)=0,\"\",SUM(Z24,AA24))","v":3239},null,"Grales.",175,838,{"$f":"IF(SUM(AE24:AF24)=0,\"\",SUM(AE24:AF24))","v":1013},66,338,{"$f":"IF(SUM(AH24:AI24)=0,\"\",SUM(AH24:AI24))","v":404},31,324,{"$f":"IF(SUM(AK24:AL24)=0,\"\",SUM(AK24:AL24))","v":355},{"$f":"IF(SUM(AE24,AH24,AK24)=0,\"\",SUM(AE24,AH24,AK24))","v":272},{"$f":"IF(SUM(AF24,AI24,AL24)=0,\"\",SUM(AF24,AI24,AL24))","v":1500},null,227,1141,{"$f":"IF(SUM(AQ24,AR24)=0,\"\",SUM(AQ24,AR24))","v":1368},null,"Grales.",61,549,{"$f":"IF(SUM(AV24:AW24)=0,\"\",SUM(AV24:AW24))","v":610},119,556,{"$f":"IF(SUM(AY24:AZ24)=0,\"\",SUM(AY24:AZ24))","v":675},{"$f":"IF(SUM(AV24,AY24)=0,\"\",SUM(AV24,AY24))","v":180},{"$f":"IF(SUM(AW24,AZ24)=0,\"\",SUM(AW24,AZ24))","v":1105},{"$f":"IF(SUM(BB24:BC24)=0,\"\",SUM(BB24:BC24))","v":1285},null,188,1136,{"$f":"IF(SUM(BF24,BG24)=0,\"\",SUM(BF24,BG24))","v":1324}]
["Técs.",190,329,{"$f":"IF(SUM(B25,C25)=0,\"\",SUM(B25,C25))","v":519},192,427,{"$f":"IF(SUM(E25,F25)=0,\"\",SUM(E25,F25))","v":619},171,486,{"$f":"IF(SUM(H25,I25)=0,\"\",SUM(H25,I25))","v":657},141,509,{"$f":"IF(SUM(K25,L25)=0,\"\",SUM(K25,L25))","v":650},286,580,{"$f":"IF(SUM(N25,O25)=0,\"\",SUM(N25,O25))","v":866},127,511,{"$f":"IF(SUM(Q25,R25)=0,\"\",SUM(Q25,R25))","v":638},203,406,{"$f":"IF(SUM(T25,U25)=0,\"\",SUM(T25,U25))","v":609},{"$f":"IF(SUM(B25,E25,H25,K25,N25,Q25,T25)=0,\"\",SUM(B25,E25,H25,K25,N25,Q25,T25))","v":1310},{"$f":"IF(SUM(C25,F25,I25,L25,O25,R25,U25)=0,\"\",SUM(C25,F25,I25,L25,O25,R25,U25))","v":3248},null,879,1672,{"$f":"IF(SUM(Z25,AA25)=0,\"\",SUM(Z25,AA25))","v":2551},null,"Técs.",75,552,{"$f":"IF(SUM(AE25:AF25)=0,\"\",SUM(AE25:AF25))","v":627},59,385,{"$f":"IF(SUM(AH25:AI25)=0,\"\",SUM(AH25:AI25))","v":444},18,96,114,{"$f":"IF(SUM(AE25,AH25,AK25)=0,\"\",SUM(AE25,AH25,AK25))","v":152},{"$f":"IF(SUM(AF25,AI25,AL25)=0,\"\",SUM(AF25,AI25,AL25))","v":1033},null,97,520,{"$f":"IF(SUM(AQ25,AR25)=0,\"\",SUM(AQ25,AR25))","v":617},null,"Técs.",59,497,{"$f":"IF(SUM(AV25:AW25)=0,\"\",SUM(AV25:AW25))","v":556},62,579,{"$f":"IF(SUM(AY25:AZ25)=0,\"\",SUM(AY25:AZ25))","v":641},{"$f":"IF(SUM(AV25,AY25)=0,\"\",SUM(AV25,AY25))","v":121},{"$f":"IF(SUM(AW25,AZ25)=0,\"\",SUM(AW25,AZ25))","v":1076},1197,null,228,926,{"$f":"IF(SUM(BF25,BG25)=0,\"\",SUM(BF25,BG25))","v":1154}]
["Telesec.",41,202,243,49,172,221,36,246,282,42,179,221,51,212,263,45,186,231,26,136,162,290,1333,null,118,449,567,null,"Telesec.",41,172,213,19,91,110,15,55,70,75,318,null,48,165,213,null,"Telesec.",24,182,206,13,156,169,37,338,375,null,31,231,262]
[null,null,null,"",null,null,"",null,null,"",null,null,"",null,null,"",null,null,"",null,null,"","","",null,null,null,"",null,null,null,null,"",null,null,"",null,null,"","","",null,null,null,"",null,null,null,null,"",null,null,"","","","",null,null,null,""]
[null,null,null,"",null,null,"",null,null,"",null,null,"",null,null,"",null,null,"",null,null,"","","",null,null,null,"",null,null,null,null,"",null,null,"",null,null,"","","",null,null,null,"",null,null,null,null,"",null,null,"","","","",null,null,null,""]
[null,null,null,"",null,null,"",null,null,"",null,null,"",null,null,"",null,null,"",null,null,"","","",null,null,null,"",null,null,null,null,"",null,null,"",null,null,"","","",null,null,null,"",null,null,null,null,"",null,null,"","","","",null,null,null,""]
[null,null,null,"",null,null,"",null,null,"",null,null,"",null,null,"",null,null,"",null,null,"","","",null,null,null,"",null,null,null,null,"",null,null,"",null,null,"","","",null,null,null,"",null,null,null,null,"",null,null,"","","","",null,null,null,""]
["Total",{"$f":"IF(SUM(B24:B30)=0,\"\",SUM(B24:B30))","v":447},{"$f":"IF(SUM(C24:C30)=0,\"\",SUM(C24:C30))","v":1038},1485,428,1239,1667,495,1408,1903,403,1223,1626,569,1375,1944,375,1276,1651,407,1103,1510,{"$f":"IF(SUM(W24:W30)=0,\"\",SUM(W24:W30))","v":3124},{"$f":"IF(SUM(X24:Y30)=0,\"\",SUM(X24:Y30))","v":8662},null,{"$f":"IF(SUM(Z24:Z30)=0,\"\",SUM(Z24:Z30))","v":2106},{"$f":"IF(SUM(AA24:AA30)=0,\"\",SUM(AA24:AA30))","v":4251},{"$f":"IF(SUM(AB24:AB30)=0,\"\",SUM(AB24:AB30))","v":6357},null,"Total",{"$f":"IF(SUM(AE24:AE30)=0,\"\",SUM(AE24:AE30))","v":291},1562,1853,144,814,958,64,475,539,499,2851,null,{"$f":"IF(SUM(AQ24:AQ30)=0,\"\",SUM(AQ24:AQ30))","v":372},{"$f":"IF(SUM(AR24:AR30)=0,\"\",SUM(AR24:AR30))","v":1826},{"$f":"IF(SUM(AS24:AS30)=0,\"\",SUM(AS24:AS30))","v":2198},null,"Total",{"$f":"IF(SUM(AV24:AV30)=0,\"\",SUM(AV24:AV30))","v":144},1228,1372,194,1291,1485,{"$f":"IF(SUM(BB24:BB30)=0,\"\",SUM(BB24:BB30))","v":338},2519,2857,null,{"$f":"IF(SUM(BF24:BF30)=0,\"\",SUM(BF24:BF30))","v":447},{"$f":"IF(SUM(BG24:BG30)=0,\"\",SUM(BG24:BG30))","v":2293},{"$f":"IF(SUM(BH24:BH30)=0,\"\",SUM(BH24:BH30))","v":2740}]
[]
["Nota: Para las columnas \"Alumnos con uno o mas Campos, Áreas, Clubes en riesgo de no acreditar\" se registrará el Total de Alumnos en esta situación, se debrá anotar una sola vez, no importando la cantidad de Campos reprobados o con seis, ni las Áreas o Clubes con Niveles de Desempeño I y II."]

{"sheet":"Gráfica APROV 1","index":1,"n_rows":12,"n_cols":8,"rows_kept":12,"cut":false,"hidden":false,"merged":[]}
[null,"Lengua Materna (Español)","Lengua Extranjera (Inglés)","Matemáticas","Ciencias y Tecnología Biología","Historia","Geografía","Formación Cívica y Ética"]
[]
[]
[null,"GRAFICAS PARA DESARROLLO PERSONAL"]
[]
[null,"Artes","Tutoría y Desarrollo Socioemocional","Educación Física"]
[null,{"$f":"Graficas(+'APROV 1'!AE19)","v":3},{"$f":"Graficas(+'APROV 1'!AH19)","v":3},{"$f":"Graficas(+'APROV 1'!AK19)","v":4}]
[]
[null,"GRAFICA PARA AUTONOMIA CURRICULAR"]
[]
[null,"Clubes de Necesidad","Clubes de Interés"]
[null,{"$f":"Graficas(+'APROV 1'!AV19)","v":3},{"$f":"Graficas(+'APROV 1'!AY19)","v":3}]

{"sheet":"APROV 2 y 3","index":2,"n_rows":69,"n_cols":56,"rows_kept":69,"cut":false,"hidden":false,"merged":[[8,43,8,51],[54,50,54,51],[52,50,52,51],[51,50,51,51],[50,50,50,51],[49,50,49,51],[47,50,47,51],[46,50,46,51],[20,43,20,51],[44,43,44,51],[13,50,13,51],[14,44,14,46],[14,47,14,49],[14,50,14,51],[12,44,12,46],[12,47,12,49],[12,50,12,51],[11,44,11,46],[16,44,16,46],[16,47,16,49],[16,50,16,51],[18,44,18,46],[18,47,18,49],[18,50,18,51],[0,0,0,58],[1,0,1,58],[2,0,2,58],[3,0,3,54],[4,0,4,58],[6,0,6,58],[9,50,9,51],[9,26,10,26],[10,27,10,29],[10,30,10,32],[10,33,10,35],[9,19,9,20],[8,0,8,20],[8,26,8,37],[9,0,10,0],[9,44,9,46],[10,44,10,46],[9,1,9,3],[9,4,9,6],[9,7,9,9],[10,36,10,37],[10,50,10,51],[10,2,10,3],[10,5,10,6],[14,36,14,37],[14,33,14,35],[13,36,13,37],[13,33,13,35],[13,30,13,32],[13,27,13,29],[15,50,15,51],[11,47,11,49],[11,50,11,51],[12,33,12,35],[12,36,12,37],[13,44,13,46],[13,47,13,49],[12,27,12,29],[12,30,12,32],[11,27,11,29],[11,30,11,32],[11,33,11,35],[11,36,11,37],[14,30,14,32],[14,27,14,29],[14,11,14,12],[14,14,14,15],[14,17,14,18],[16,11,16,12],[16,14,16,15],[16,17,16,18],[15,11,15,12],[15,14,15,15],[15,17,15,18],[16,27,16,29],[16,30,16,32],[15,44,15,46],[15,47,15,49],[16,36,16,37],[16,33,16,35],[15,36,15,37],[15,33,15,35],[15,30,15,32],[15,27,15,29],[18,27,18,29],[18,30,18,32],[18,33,18,35],[18,36,18,37],[18,11,18,12],[18,14,18,15],[18,17,18,18],[21,0,22,0],[21,1,21,3],[21,4,21,6],[21,7,21,9],[21,10,21,12],[21,13,21,15],[21,16,21,18],[21,19,21,20],[32,0,34,58],[45,0,46,0],[45,33,45,35],[46,33,46,35],[46,36,46,37],[47,11,47,12],[47,14,47,15],[47,17,47,18],[21,36,21,37],[21,43,22,43],[45,43,46,43],[46,44,46,46],[46,47,46,49],[20,53,21,55],[47,5,47,6],[47,8,47,9],[20,0,20,20],[20,22,21,24],[20,26,20,37],[20,39,21,41],[21,26,22,26],[54,11,54,12],[54,27,54,29],[56,43,56,51],[56,0,56,20],[48,50,48,51],[48,33,48,35],[48,36,48,37],[48,44,48,46],[48,47,48,49],[48,30,48,32],[48,11,48,12],[48,14,48,15],[48,17,48,18],[49,11,49,12],[49,14,49,15],[49,17,49,18],[54,2,54,3],[50,5,50,6],[50,8,50,9],[51,5,51,6],[51,8,51,9],[52,5,52,6],[52,8,52,9],[54,5,54,6],[68,0,70,58],[57,36,57,37],[57,43,58,43],[57,44,57,46],[57,47,57,49],[57,50,57,51],[57,0,58,0],[57,1,57,3],[57,4,57,6],[57,7,57,9],[57,10,57,12],[57,13,57,15],[57,16,57,18],[57,19,57,20],[56,22,57,24],[56,26,56,37],[56,39,57,41],[57,26,58,26],[57,27,57,29],[57,30,57,32],[57,33,57,35],[56,53,57,55],[10,8,10,9],[10,11,10,12],[10,14,10,15],[10,17,10,18],[9,33,9,35],[9,43,10,43],[9,36,9,37],[9,10,9,12],[9,13,9,15],[9,16,9,18],[9,47,9,49],[10,47,10,49],[9,27,9,29],[9,30,9,32],[46,2,46,3],[46,5,46,6],[46,8,46,9],[46,11,46,12],[46,14,46,15],[46,17,46,18],[44,0,44,20],[44,26,44,37],[45,1,45,3],[45,4,45,6],[45,7,45,9],[45,10,45,12],[45,13,45,15],[45,16,45,18],[45,19,45,20],[45,26,46,26],[45,27,45,29],[45,30,45,32],[46,27,46,29],[46,30,46,32],[11,2,11,3],[12,2,12,3],[13,2,13,3],[14,2,14,3],[15,2,15,3],[18,2,18,3],[11,5,11,6],[11,8,11,9],[14,5,14,6],[14,8,14,9],[15,5,15,6],[15,8,15,9],[18,5,18,6],[18,8,18,9],[16,2,16,3],[16,5,16,6],[16,8,16,9],[17,2,17,3],[11,11,11,12],[11,14,11,15],[11,17,11,18],[12,5,12,6],[12,8,12,9],[12,11,12,12],[12,14,12,15],[13,5,13,6],[13,8,13,9],[13,11,13,12],[13,14,13,15],[13,17,13,18],[12,17,12,18],[54,8,54,9],[48,5,48,6],[48,8,48,9],[49,5,49,6],[49,8,49,9],[50,2,50,3],[47,2,47,3],[48,2,48,3],[49,2,49,3],[53,8,53,9],[53,5,53,6],[53,2,53,3],[51,2,51,3],[52,2,52,3],[17,17,17,18],[17,14,17,15],[17,11,17,12],[17,8,17,9],[17,5,17,6],[42,0,42,58],[40,0,40,58],[39,0,39,54],[38,0,38,58],[37,0,37,58],[36,0,36,58],[17,36,17,37],[17,33,17,35],[17,30,17,32],[17,27,17,29],[17,50,17,51],[17,47,17,49],[17,44,17,46],[21,27,21,29],[21,30,21,32],[21,33,21,35],[21,47,21,49],[21,44,21,46],[21,50,21,51],[53,11,53,12],[53,36,53,37],[53,33,53,35],[53,30,53,32],[53,27,53,29],[50,11,50,12],[50,14,50,15],[50,17,50,18],[51,33,51,35],[51,36,51,37],[52,11,52,12],[52,14,52,15],[52,17,52,18],[51,11,51,12],[51,14,51,15],[51,17,51,18],[52,27,52,29],[51,30,51,32],[51,27,51,29],[51,44,51,46],[51,47,51,49],[52,33,52,35],[52,36,52,37],[52,44,52,46],[52,47,52,49],[50,27,50,29],[50,33,50,35],[54,14,54,15],[54,17,54,18],[53,17,53,18],[53,14,53,15],[52,30,52,32],[54,30,54,32],[54,33,54,35],[54,36,54,37],[54,44,54,46],[54,47,54,49],[53,50,53,51],[53,47,53,49],[53,44,53,46],[45,44,45,46],[45,47,45,49],[45,36,45,37],[45,50,45,51],[48,27,48,29],[47,30,47,32],[47,33,47,35],[47,36,47,37],[47,44,47,46],[47,47,47,49],[47,27,47,29],[49,30,49,32],[49,33,49,35],[49,36,49,37],[49,44,49,46],[49,47,49,49],[50,36,50,37],[50,44,50,46],[49,27,49,29],[50,47,50,49],[50,30,50,32]]}
["SECRETARÍA DE EDUCACIÓN PÚBLICA DEL ESTADO DE BAJA CALIFORNIA SUR"]
["DIRECCIÓN DE EDUCACIÓN SECUNDARIA"]
["CICLO ESCOLAR 2018 - 2019"]
[]
["APROVECHAMIENTO, BAJO APROVECHAMIENTO Y REPROBACIÓN"]
[]
["DIRECCIÓN: EDUCACIÓN SECUNDARIA    DIRECTOR: PROFR. RUMUALDO RAMÍREZ GUTIERRÉZ     PERIODO DE EVALUACIÓN:  PRIMERO  "]
[]
["Promedio de Aprovechamiento de los Campos de Formación Académica",null,null,null,null,null,null,null,null,null,null,null,null,null,null,null,null,null,null,null,null,null,null,null,null,null,"Promedio de Aprovechamiento de las Áreas de Desarrollo Personal y Social",null,null,null,null,null,null,null,null,null,null,null,null,null,null,null,null,"Promedio de Aprovechamiento de los Clubes de Autonomía Curricular"]
["Modalidad","Español II",null,null,"Segunda Lengua Inglés II",null,null,"Matemáticas II",null,null,"Ciencias II (Enfásis en Física)",null,null,"Historia I",null,null,"Formación Cívica y Ética I",null,null,"Prom. Final",null,null,null,null,null,null,"Modalidad","Artes",null,null,"Tutoría y Desarrollo Socioemocional",null,null,"Educación Física",null,null,"Prom. Final",null,null,null,null,null,null,"Modalidad","Club 1 Necesidad",null,null,"Club 2    Interés",null,null,"Prom. Final"]
[null,"ND","CALIF",null,"ND","CALIF",null,"ND","CALIF",null,"ND","CALIF",null,"ND","CALIF",null,"ND","CALIF",null,"ND","CALIF",null,null,null,null,null,null,"ND",null,null,"ND",null,null,"ND",null,null,"ND",null,null,null,null,null,null,null,"ND",null,null,"ND",null,null,"ND"]
["Grales.",{"$f":"IFERROR(IF(AND(C12<=10,C12>=9.5),\"IV\",IF(AND(C12<9.5,C12>=7.5),\"III\",IF(AND(C12<7.5,C12>=6),\"II\",IF(AND(C12<6,C12>=5),\"I\",\"\")))),\"\")","v":"III"},8.3000000000000007,null,{"$f":"IFERROR(IF(AND(F12<=10,F12>=9.5),\"IV\",IF(AND(F12<9.5,F12>=7.5),\"III\",IF(AND(F12<7.5,F12>=6),\"II\",IF(AND(F12<6,F12>=5),\"I\",\"\")))),\"\")","v":"III"},8.4,null,{"$f":"IFERROR(IF(AND(I12<=10,I12>=9.5),\"IV\",IF(AND(I12<9.5,I12>=7.5),\"III\",IF(AND(I12<7.5,I12>=6),\"II\",IF(AND(I12<6,I12>=5),\"I\",\"\")))),\"\")","v":"III"},8.1,null,{"$f":"IFERROR(IF(AND(L12<=10,L12>=9.5),\"IV\",IF(AND(L12<9.5,L12>=7.5),\"III\",IF(AND(L12<7.5,L12>=6),\"II\",IF(AND(L12<6,L12>=5),\"I\",\"\")))),\"\")","v":"III"},8.4,null,{"$f":"IFERROR(IF(AND(O12<=10,O12>=9.5),\"IV\",IF(AND(O12<9.5,O12>=7.5),\"III\",IF(AND(O12<7.5,O12>=6),\"II\",IF(AND(O12<6,O12>=5),\"I\",\"\")))),\"\")","v":"III"},8.5,null,{"$f":"IFERROR(IF(AND(R12<=10,R12>=9.5),\"IV\",IF(AND(R12<9.5,R12>=7.5),\"III\",IF(AND(R12<7.5,R12>=6),\"II\",IF(AND(R12<6,R12>=5),\"I\",\"\")))),\"\")","v":"III"},8.6,null,{"$f":"IFERROR(IF(AND(U12<=10,U12>=9.5),\"IV\",IF(AND(U12<9.5,U12>=7.5),\"III\",IF(AND(U12<7.5,U12>=6),\"II\",IF(AND(U12<6,U12>=5),\"I\",\"\")))),\"\")","v":"III"},{"$f":"ROUND(IFERROR(AVERAGE(C12,F12,I12,L12,O12,R12),\"\"),1)","v":8.4},null,null,null,null,null,"Grales.","III",null,null,"IV",null,null,"IV",null,null,{"$f":"Nivel(AB12,AE12,AH12)","v":"IV"},null,null,null,null,null,null,"Grales.","IV",null,null,"III",null,null,{"$f":"Nivel_2(AS12,AV12)","v":"IV"}]
["Técs.","III",8.1,null,"III",8,null,"III",8,null,"III",8.1,null,"III",8.1999999999999993,null,"III",8.3000000000000007,null,"III",{"$f":"ROUND(IFERROR(AVERAGE(C13,F13,I13,L13,O13,R13),\"\"),1)","v":8.1},null,null,null,null,null,"Técs.","III",null,null,"IV",null,null,"IV",null,null,{"$f":"Nivel(AB13,AE13,AH13)","v":"IV"},null,null,null,null,null,null,"Técs.","III",null,null,"IV",null,null,{"$f":"Nivel_2(AS13,AV13)","v":"IV"}]
["Telesec.","III",8.1999999999999993,null,"III",8,null,"III",8,null,"III",8,null,"III",8,null,"III",8.4,null,"III",{"$f":"ROUND(IFERROR(AVERAGE(C14,F14,I14,L14,O14,R14),\"\"),1)","v":8.1},null,null,null,null,null,"Telesec.","III",null,null,"III",null,null,"IV",null,null,"III",null,null,null,null,null,null,"Telesec.","III",null,null,"III",null,null,"III"]
[null,"",null,null,"",null,null,"",null,null,"",null,null,"",null,null,"",null,null,"",{"$f":"IFERROR(AVERAGE(C15,F15,I15,L15,O15,R15),\"\")","v":""},null,null,null,null,null,null,null,null,null,null,null,null,null,null,null,"",null,null,null,null,null,null,null,null,null,null,null,null,null,""]
[null,"",null,null,"",null,null,"",null,null,"",null,null,"",null,null,"",null,null,"","",null,null,null,null,null,null,null,null,null,null,null,null,null,null,null,"",null,null,null,null,null,null,null,null,null,null,null,null,null,""]
[null,"",null,null,"",null,null,"",null,null,"",null,null,"",null,null,"",null,null,"","",null,null,null,null,null,null,null,null,null,null,null,null,null,null,null,"",null,null,null,null,null,null,null,null,null,null,null,null,null,""]
[null,"",null,null,"",null,null,"",null,null,"",null,null,"",null,null,"",null,null,"","",null,null,null,null,null,null,null,null,null,null,null,null,null,null,null,"",null,null,null,null,null,null,null,null,null,null,null,null,null,""]
["Gral.",{"$f":"IFERROR(IF(AND(C19<=10,C19>=9.5),\"IV\",IF(AND(C19<9.5,C19>=7.5),\"III\",IF(AND(C19<7.5,C19>=6),\"II\",IF(AND(C19<6,C19>=5),\"I\",\"\")))),\"\")","v":"III"},{"$f":"ROUND(IFERROR(AVERAGE(C12:D18),\"\"),1)","v":8.1999999999999993},null,{"$f":"IFERROR(IF(AND(F19<=10,F19>=9.5),\"IV\",IF(AND(F19<9.5,F19>=7.5),\"III\",IF(AND(F19<7.5,F19>=6),\"II\",IF(AND(F19<6,F19>=5),\"I\",\"\")))),\"\")","v":"III"},{"$f":"ROUND(IFERROR(AVERAGE(F12:G18),\"\"),1)","v":8.1},null,{"$f":"IFERROR(IF(AND(I19<=10,I19>=9.5),\"IV\",IF(AND(I19<9.5,I19>=7.5),\"III\",IF(AND(I19<7.5,I19>=6),\"II\",IF(AND(I19<6,I19>=5),\"I\",\"\")))),\"\")","v":"III"},{"$f":"ROUND(IFERROR(AVERAGE(I12:J18),\"\"),1)","v":8},null,{"$f":"IFERROR(IF(AND(L19<=10,L19>=9.5),\"IV\",IF(AND(L19<9.5,L19>=7.5),\"III\",IF(AND(L19<7.5,L19>=6),\"II\",IF(AND(L19<6,L19>=5),\"I\",\"\")))),\"\")","v":"III"},{"$f":"ROUND(IFERROR(AVERAGE(L12:M18),\"\"),1)","v":8.1999999999999993},null,{"$f":"IFERROR(IF(AND(O19<=10,O19>=9.5),\"IV\",IF(AND(O19<9.5,O19>=7.5),\"III\",IF(AND(O19<7.5,O19>=6),\"II\",IF(AND(O19<6,O19>=5),\"I\",\"\")))),\"\")","v":"III"},{"$f":"ROUND(IFERROR(AVERAGE(O12:P18),\"\"),1)","v":8.1999999999999993},null,{"$f":"IFERROR(IF(AND(R19<=10,R19>=9.5),\"IV\",IF(AND(R19<9.5,R19>=7.5),\"III\",IF(AND(R19<7.5,R19>=6),\"II\",IF(AND(R19<6,R19>=5),\"I\",\"\")))),\"\")","v":"III"},{"$f":"ROUND(IFERROR(AVERAGE(R12:S18),\"\"),1)","v":8.4},null,{"$f":"IFERROR(IF(AND(U19<=10,U19>=9.5),\"IV\",IF(AND(U19<9.5,U19>=7.5),\"III\",IF(AND(U19<7.5,U19>=6),\"II\",IF(AND(U19<6,U19>=5),\"I\",\"\")))),\"\")","v":"III"},{"$f":"ROUND(IFERROR(AVERAGE(U12:U18),\"\"),1)","v":8.1999999999999993},null,null,null,null,null,"Gral.",{"$f":"total(AB12,AB13,AB14,AB15,AB16,AB17,AB18)","v":"III"},null,null,{"$f":"total(AE12,AE13,AE14,AE15,AE16,AE17,AE18)","v":"IV"},null,null,{"$f":"total(AH12,AH13,AH14,AH15,AH16,AH17,AH18)","v":"IV"},null,null,{"$f":"total(AK12,AK13,AK14,AK15,AK16,AK17,AK18)","v":"IV"},null,null,null,null,null,null,"Gral.",{"$f":"total(AS12,AS13,AS14,AS15,AS16,AS17,AS18)","v":"III"},null,null,{"$f":"total(AV12,AV13,AV14,AV15,AV16,AV17,AV18)","v":"III"},null,null,{"$f":"total(AY12,AY13,AY14,AY15,AY16,AY17,AY18)","v":"IV"}]
[]
["Campos de Formación Académica en situacion de riesgo de no acreditar",null,null,null,null,null,null,null,null,null,null,null,null,null,null,null,null,null,null,null,null,null,"Alumnos con uno o mas Campos en riesgo de no acreditar",null,null,null,"Áreas de Desarrollo Personal y Social en situacion de riesgo de no acreditar",null,null,null,null,null,null,null,null,null,null,null,null,"Alumnos con una o mas Áreas en riesgo de no acreditar",null,null,null,"Clubes de Autonomía Curricular en situacion de riesgo de no acreditar",null,null,null,null,null,null,null,null,null,"Alumnos con uno o mas Clubes en riesgo de no acreditar"]
["Modalidad","Español II",null,null,"Segunda Lengua Inglés II",null,null,"Matemáticas II",null,null,"Ciencias II (Enfásis en Física)",null,null,"Historia I",null,null,"Formación Cívica y Ética I",null,null,"Total",null,null,null,null,null,null,"Modalidad","Artes",null,null,"Tutoría y Desarrollo Socioemocional",null,null,"Educación Física",null,null,"Total",null,null,null,null,null,null,"Modalidad","Club 1 Necesidad",null,null,"Club 2    Interés",null,null,"Total"]
[null,5,6,"T",5,6,"T",5,6,"T",5,6,"T",5,6,"T",5,6,"T",5,6,null,5,6,"T",null,null,"ND I","ND II","T","ND I","ND II","T","ND I","ND II","T","ND I","ND II",null,"ND I","ND II","T",null,null,"ND I","ND II","T","ND I","ND II","T","ND I","ND II",null,"ND I","ND II","T"]
["Grales.",261,660,{"$f":"IF(SUM(B24,C24)=0,\"\",SUM(B24,C24))","v":921},240,612,{"$f":"IF(SUM(E24,F24)=0,\"\",SUM(E24,F24))","v":852},326,805,{"$f":"IF(SUM(H24,I24)=0,\"\",SUM(H24,I24))","v":1131},264,647,{"$f":"IF(SUM(K24,L24)=0,\"\",SUM(K24,L24))","v":911},211,449,{"$f":"IF(SUM(N24,O24)=0,\"\",SUM(N24,O24))","v":660},209,500,{"$f":"IF(SUM(Q24,R24)=0,\"\",SUM(Q24,R24))","v":709},{"$f":"IF(SUM(B24,E24,H24,K24,N24,Q24)=0,\"\",SUM(B24,E24,H24,K24,N24,Q24))","v":1511},{"$f":"IF(SUM(C24,F24,I24,L24,O24,R24)=0,\"\",SUM(C24,F24,I24,L24,O24,R24))","v":3673},null,815,1689,{"$f":"IF(SUM(W24,X24)=0,\"\",SUM(W24,X24))","v":2504},null,"Grales.",146,742,{"$f":"IF(SUM(AB24:AC24)=0,\"\",SUM(AB24:AC24))","v":888},75,495,{"$f":"IF(SUM(AE24:AF24)=0,\"\",SUM(AE24:AF24))","v":570},43,386,{"$f":"IF(SUM(AH24:AI24)=0,\"\",SUM(AH24:AI24))","v":429},{"$f":"IF(SUM(AB24,AE24,AH24)=0,\"\",SUM(AB24,AE24,AH24))","v":264},{"$f":"IF(SUM(AC24,AF24,AI24)=0,\"\",SUM(AC24,AF24,AI24))","v":1623},null,209,2017,{"$f":"IF(SUM(AN24,AO24)=0,\"\",SUM(AN24,AO24))","v":2226},null,"Grales.",122,545,{"$f":"IF(SUM(AS24:AT24)=0,\"\",SUM(AS24:AT24))","v":667},108,525,{"$f":"IF(SUM(AV24:AW24)=0,\"\",SUM(AV24:AW24))","v":633},{"$f":"IF(SUM(AS24,AV24)=0,\"\",SUM(AS24,AV24))","v":230},{"$f":"IF(SUM(AT24,AW24)=0,\"\",SUM(AT24,AW24))","v":1070},null,192,889,{"$f":"IF(SUM(BB24,BC24)=0,\"\",SUM(BB24,BC24))","v":1081}]
["Técs.",296,501,{"$f":"IF(SUM(B25,C25)=0,\"\",SUM(B25,C25))","v":797},333,601,{"$f":"IF(SUM(E25,F25)=0,\"\",SUM(E25,F25))","v":934},271,518,{"$f":"IF(SUM(H25,I25)=0,\"\",SUM(H25,I25))","v":789},416,467,{"$f":"IF(SUM(K25,L25)=0,\"\",SUM(K25,L25))","v":883},307,470,{"$f":"IF(SUM(N25,O25)=0,\"\",SUM(N25,O25))","v":777},288,504,{"$f":"IF(SUM(Q25,R25)=0,\"\",SUM(Q25,R25))","v":792},{"$f":"IF(SUM(B25,E25,H25,K25,N25,Q25)=0,\"\",SUM(B25,E25,H25,K25,N25,Q25))","v":1911},{"$f":"IF(SUM(C25,F25,I25,L25,O25,R25)=0,\"\",SUM(C25,F25,I25,L25,O25,R25))","v":3061},null,1263,1823,{"$f":"IF(SUM(W25,X25)=0,\"\",SUM(W25,X25))","v":3086},null,"Técs.",160,698,{"$f":"IF(SUM(AB25:AC25)=0,\"\",SUM(AB25:AC25))","v":858},75,499,{"$f":"IF(SUM(AE25:AF25)=0,\"\",SUM(AE25:AF25))","v":574},14,208,222,{"$f":"IF(SUM(AB25,AE25,AH25)=0,\"\",SUM(AB25,AE25,AH25))","v":249},1405,null,175,708,{"$f":"IF(SUM(AN25,AO25)=0,\"\",SUM(AN25,AO25))","v":883},null,"Técs.",123,435,{"$f":"IF(SUM(AS25:AT25)=0,\"\",SUM(AS25:AT25))","v":558},110,412,{"$f":"IF(SUM(AV25:AW25)=0,\"\",SUM(AV25:AW25))","v":522},{"$f":"IF(SUM(AS25,AV25)=0,\"\",SUM(AS25,AV25))","v":233},{"$f":"IF(SUM(AT25,AW25)=0,\"\",SUM(AT25,AW25))","v":847},null,176,667,{"$f":"IF(SUM(BB25,BC25)=0,\"\",SUM(BB25,BC25))","v":843}]
["Telesec.",46,122,168,96,149,245,57,173,230,69,163,232,78,153,231,34,100,134,380,860,null,186,384,570,null,"Telesec.",14,140,154,11,145,156,5,55,60,30,340,null,24,220,244,null,"Telesec.",19,150,169,14,115,129,33,265,null,12,191,203]
[null,null,null,"",null,null,"",null,null,"",null,null,"",null,null,"",null,null,"","","",null,null,null,"",null,null,null,null,"",null,null,"",null,null,"","","",null,null,null,"",null,null,null,null,"",null,null,"","","",null,null,null,""]
[null,null,null,"",null,null,"",null,null,"",null,null,"",null,null,"",null,null,"","","",null,null,null,"",null,null,null,null,"",null,null,"",null,null,"","","",null,null,null,"",null,null,null,null,"",null,null,"","","",null,null,null,""]
[null,null,null,"",null,null,"",null,null,"",null,null,"",null,null,"",null,null,"","","",null,null,null,"",null,null,null,null,"",null,null,"",null,null,"","","",null,null,null,"",null,null,null,null,"",null,null,"","","",null,null,null,""]
[null,null,null,"",null,null,"",null,null,"",null,null,"",null,null,"",null,null,"","","",null,null,null,"",null,null,null,null,"",null,null,"",null,null,"","","",null,null,null,"",null,null,null,null,"",null,null,"","","",null,null,null,""]
["Total",{"$f":"IF(SUM(B24:B30)=0,\"\",SUM(B24:B30))","v":603},{"$f":"IF(SUM(C24:C30)=0,\"\",SUM(C24:C30))","v":1283},1886,669,1362,2031,654,1496,2150,749,1277,2026,596,1072,1668,531,1104,1635,{"$f":"IF(SUM(T24:T30)=0,\"\",SUM(T24:T30))","v":3802},{"$f":"IF(SUM(U24:V30)=0,\"\",SUM(U24:V30))","v":7594},null,{"$f":"IF(SUM(W24:W30)=0,\"\",SUM(W24:W30))","v":2264},{"$f":"IF(SUM(X24:X30)=0,\"\",SUM(X24:X30))","v":3896},{"$f":"IF(SUM(Y24:Y30)=0,\"\",SUM(Y24:Y30))","v":6160},null,"Total",{"$f":"IF(SUM(AB24:AB30)=0,\"\",SUM(AB24:AB30))","v":320},1580,1900,161,1139,1300,62,649,711,543,3368,null,{"$f":"IF(SUM(AN24:AN30)=0,\"\",SUM(AN24:AN30))","v":408},{"$f":"IF(SUM(AO24:AO30)=0,\"\",SUM(AO24:AO30))","v":2945},{"$f":"IF(SUM(AP24:AP30)=0,\"\",SUM(AP24:AP30))","v":3353},null,"Total",{"$f":"IF(SUM(AS24:AS30)=0,\"\",SUM(AS24:AS30))","v":264},1130,1394,232,1052,1284,496,2182,null,{"$f":"IF(SUM(BB24:BB30)=0,\"\",SUM(BB24:BB30))","v":380},{"$f":"IF(SUM(BC24:BC30)=0,\"\",SUM(BC24:BC30))","v":1747},{"$f":"IF(SUM(BD24:BD30)=0,\"\",SUM(BD24:BD30))","v":2127}]
[]
["Nota: Para las columnas \"Alumnos con uno o mas Campos, Áreas, Clubes en riesgo de no acreditar\" se registrará el total de ALUMNOS en esta situación, se deberá anotar una sola vez, no importando la cantidad de Campos reprobados o con seis, ni las Áreas o Clubes con Niveles de Desempeño I y II."]
[]
[]
[]
["SECRETARÍA DE EDUCACIÓN PÚBLICA DEL ESTADO DE BAJA CALIFORNIA SUR"]
["DIRECCIÓN DE EDUCACIÓN SECUNDARIA"]
["CICLO ESCOLAR 2018 - 2019"]
[]
["APROVECHAMIENTO, BAJO APROVECHAMIENTO Y REPROBACIÓN"]
[]
["DIRECCIÓN: EDUCACIÓN SECUNDARIA    DIRECTOR: PROFR. RUMUALDO RAMÍREZ GUTIERRÉZ     PERIODO DE EVALUACIÓN:  PRIMERO  "]
[]
["Promedio de Aprovechamiento de los Campos de Formación Académica",null,null,null,null,null,null,null,null,null,null,null,null,null,null,null,null,null,null,null,null,null,null,null,null,null,"Promedio de Aprovechamiento de las Áreas de Desarrollo Personal y Social",null,null,null,null,null,null,null,null,null,null,null,null,null,null,null,null,"Promedio de Aprovechamiento de los Clubes de Autonomía Curricular"]
["Modalidad","Español III",null,null,"Segunda Lengua Inglés III",null,null,"Matemáticas III",null,null,"Ciencias III (Enfásis en Química)",null,null,"Historia II",null,null,"Formación Cívica y Ética II",null,null,"Prom. Final",null,null,null,null,null,null,"Modalidad","Artes",null,null,"Tutoría y Desarrollo Socioemocional",null,null,"Educación Física",null,null,"Prom. Final",null,null,null,null,null,null,"Modalidad","Club 1 Necesidad",null,null,"Club 2    Interés",null,null,"Prom. Final"]
[null,"ND","CALIF",null,"ND","CALIF",null,"ND","CALIF",null,"ND","CALIF",null,"ND","CALIF",null,"ND","CALIF",null,"ND","CALIF",null,null,null,null,null,null,"ND",null,null,"ND",null,null,"ND",null,null,"ND",null,null,null,null,null,null,null,"ND",null,null,"ND",null,null,"ND"]
["Grales.",{"$f":"IFERROR(IF(AND(C48<=10,C48>=9.5),\"IV\",IF(AND(C48<9.5,C48>=7.5),\"III\",IF(AND(C48<7.5,C48>=6),\"II\",IF(AND(C48<6,C48>=5),\"I\",\"\")))),\"\")","v":"III"},8.4,null,{"$f":"IFERROR(IF(AND(F48<=10,F48>=9.5),\"IV\",IF(AND(F48<9.5,F48>=7.5),\"III\",IF(AND(F48<7.5,F48>=6),\"II\",IF(AND(F48<6,F48>=5),\"I\",\"\")))),\"\")","v":"III"},8.4,null,{"$f":"IFERROR(IF(AND(I48<=10,I48>=9.5),\"IV\",IF(AND(I48<9.5,I48>=7.5),\"III\",IF(AND(I48<7.5,I48>=6),\"II\",IF(AND(I48<6,I48>=5),\"I\",\"\")))),\"\")","v":"III"},8.1,null,{"$f":"IFERROR(IF(AND(L48<=10,L48>=9.5),\"IV\",IF(AND(L48<9.5,L48>=7.5),\"III\",IF(AND(L48<7.5,L48>=6),\"II\",IF(AND(L48<6,L48>=5),\"I\",\"\")))),\"\")","v":"III"},8.3000000000000007,null,{"$f":"IFERROR(IF(AND(O48<=10,O48>=9.5),\"IV\",IF(AND(O48<9.5,O48>=7.5),\"III\",IF(AND(O48<7.5,O48>=6),\"II\",IF(AND(O48<6,O48>=5),\"I\",\"\")))),\"\")","v":"III"},8.6,null,{"$f":"IFERROR(IF(AND(R48<=10,R48>=9.5),\"IV\",IF(AND(R48<9.5,R48>=7.5),\"III\",IF(AND(R48<7.5,R48>=6),\"II\",IF(AND(R48<6,R48>=5),\"I\",\"\")))),\"\")","v":"III"},8.6,null,{"$f":"IFERROR(IF(AND(U48<=10,U48>=9.5),\"IV\",IF(AND(U48<9.5,U48>=7.5),\"III\",IF(AND(U48<7.5,U48>=6),\"II\",IF(AND(U48<6,U48>=5),\"I\",\"\")))),\"\")","v":"III"},{"$f":"ROUND(IFERROR(AVERAGE(C48,F48,I48,L48,O48,R48),\"\"),1)","v":8.4},null,null,null,null,null,"Grales.","III",null,null,"III",null,null,"IV",null,null,{"$f":"Nivel(AB48,AE48,AH48)","v":"III"},null,null,null,null,null,null,"Grales.","III",null,null,"III",null,null,{"$f":"Nivel_2(AS48,AV48)","v":"III"}]
["Técs.","III",8.3000000000000007,null,"III",8.1,null,"III",7.89,null,"III",8.1,null,"III",8.4,null,"III",8.4,null,"III",{"$f":"ROUND(IFERROR(AVERAGE(C49,F49,I49,L49,O49,R49),\"\"),1)","v":8.1999999999999993},null,null,null,null,null,"Técs.","III",null,null,"III",null,null,"IV",null,null,{"$f":"Nivel(AB49,AE49,AH49)","v":"III"},null,null,null,null,null,null,"Técs.","IV",null,null,"IV",null,null,{"$f":"Nivel_2(AS49,AV49)","v":"IV"}]
["Telesec.","III",8.1,null,"III",8.1,null,"III",8,null,"III",8.1,null,"III",8,null,"III",8.4,null,"III",{"$f":"ROUND(IFERROR(AVERAGE(C50,F50,I50,L50,O50,R50),\"\"),1)","v":8.1},null,null,null,null,null,"Telesec.","III",null,null,"III",null,null,"IV",null,null,"III",null,null,null,null,null,null,"Telesec.","III",null,null,"III",null,null,"III"]
[null,"",null,null,"",null,null,"",null,null,"",null,null,"",null,null,"",null,null,"",{"$f":"IFERROR(AVERAGE(C51,F51,I51,L51,O51,R51),\"\")","v":""},null,null,null,null,null,null,null,null,null,null,null,null,null,null,null,"",null,null,null,null,null,null,null,null,null,null,null,null,null,""]
[null,"",null,null,"",null,null,"",null,null,"",null,null,"",null,null,"",null,null,"","",null,null,null,null,null,null,null,null,null,null,null,null,null,null,null,"",null,null,null,null,null,null,null,null,null,null,null,null,null,""]
[null,"",null,null,"",null,null,"",null,null,"",null,null,"",null,null,"",null,null,"","",null,null,null,null,null,null,null,null,null,null,null,null,null,null,null,"",null,null,null,null,null,null,null,null,null,null,null,null,null,""]
[null,"",null,null,"",null,null,"",null,null,"",null,null,"",null,null,"",null,null,"","",null,null,null,null,null,null,null,null,null,null,null,null,null,null,null,"",null,null,null,null,null,null,null,null,null,null,null,null,null,""]
["Gral.",{"$f":"IFERROR(IF(AND(C55<=10,C55>=9.5),\"IV\",IF(AND(C55<9.5,C55>=7.5),\"III\",IF(AND(C55<7.5,C55>=6),\"II\",IF(AND(C55<6,C55>=5),\"I\",\"\")))),\"\")","v":"III"},{"$f":"ROUND(IFERROR(AVERAGE(C48:D54),\"\"),1)","v":8.3000000000000007},null,{"$f":"IFERROR(IF(AND(F55<=10,F55>=9.5),\"IV\",IF(AND(F55<9.5,F55>=7.5),\"III\",IF(AND(F55<7.5,F55>=6),\"II\",IF(AND(F55<6,F55>=5),\"I\",\"\")))),\"\")","v":"III"},{"$f":"ROUND(IFERROR(AVERAGE(F48:G54),\"\"),1)","v":8.1999999999999993},null,{"$f":"IFERROR(IF(AND(I55<=10,I55>=9.5),\"IV\",IF(AND(I55<9.5,I55>=7.5),\"III\",IF(AND(I55<7.5,I55>=6),\"II\",IF(AND(I55<6,I55>=5),\"I\",\"\")))),\"\")","v":"III"},{"$f":"ROUND(IFERROR(AVERAGE(I48:J54),\"\"),1)","v":8},null,{"$f":"IFERROR(IF(AND(L55<=10,L55>=9.5),\"IV\",IF(AND(L55<9.5,L55>=7.5),\"III\",IF(AND(L55<7.5,L55>=6),\"II\",IF(AND(L55<6,L55>=5),\"I\",\"\")))),\"\")","v":"III"},{"$f":"ROUND(IFERROR(AVERAGE(L48:M54),\"\"),1)","v":8.1999999999999993},null,{"$f":"IFERROR(IF(AND(O55<=10,O55>=9.5),\"IV\",IF(AND(O55<9.5,O55>=7.5),\"III\",IF(AND(O55<7.5,O55>=6),\"II\",IF(AND(O55<6,O55>=5),\"I\",\"\")))),\"\")","v":"III"},{"$f":"ROUND(IFERROR(AVERAGE(O48:P54),\"\"),1)","v":8.3000000000000007},null,{"$f":"IFERROR(IF(AND(R55<=10,R55>=9.5),\"IV\",IF(AND(R55<9.5,R55>=7.5),\"III\",IF(AND(R55<7.5,R55>=6),\"II\",IF(AND(R55<6,R55>=5),\"I\",\"\")))),\"\")","v":"III"},{"$f":"ROUND(IFERROR(AVERAGE(R48:S54),\"\"),1)","v":8.5},null,{"$f":"IFERROR(IF(AND(U55<=10,U55>=9.5),\"IV\",IF(AND(U55<9.5,U55>=7.5),\"III\",IF(AND(U55<7.5,U55>=6),\"II\",IF(AND(U55<6,U55>=5),\"I\",\"\")))),\"\")","v":"III"},{"$f":"ROUND(IFERROR(AVERAGE(U48:U54),\"\"),1)","v":8.1999999999999993},null,null,null,null,null,"Gral.",{"$f":"total(AB48,AB49,AB50,AB51,AB52,AB53,AB54)","v":"III"},null,null,{"$f":"total(AE48,AE49,AE50,AE51,AE52,AE53,AE54)","v":"III"},null,null,{"$f":"total(AH48,AH49,AH50,AH51,AH52,AH53,AH54)","v":"IV"},null,null,{"$f":"total(AK48,AK49,AK50,AK51,AK52,AK53,AK54)","v":"III"},null,null,null,null,null,null,"Gral.",{"$f":"total(AS48,AS49,AS50,AS51,AS52,AS53,AS54)","v":"III"},null,null,{"$f":"total(AV48,AV49,AV50,AV51,AV52,AV53,AV54)","v":"III"},null,null,{"$f":"total(AY48,AY49,AY50,AY51,AY52,AY53,AY54)","v":"III"}]
[]
["Campos de Formación Académica en situacion de riesgo de no acreditar",null,null,null,null,null,null,null,null,null,null,null,null,null,null,null,null,null,null,null,null,null,"Alumnos con uno o mas Campos en riesgo de no acreditar",null,null,null,"Áreas de Desarrollo Personal y Social en situacion de riesgo de no acreditar",null,null,null,null,null,null,null,null,null,null,null,null,"Alumnos con una o mas Áreas en riesgo de no acreditar",null,null,null,"Clubes de Autonomía Curricular en situacion de riesgo de no acreditar",null,null,null,null,null,null,null,null,null,"Alumnos con uno o mas Clubes en riesgo de no acreditar"]
["Modalidad","Español III",null,null,"Segunda Lengua Inglés III",null,null,"Matemáticas III",null,null,"Ciencias III (Enfásis en Química)",null,null,"Historia II",null,null,"Formación Cívica y Ética II",null,null,"Total",null,null,null,null,null,null,"Modalidad","Artes",null,null,"Tutoría y Desarrollo Socioemocional",null,null,"Educación Física",null,null,"Total",null,null,null,null,null,null,"Modalidad","Club 1 Necesidad",null,null,"Club 2    Interés",null,null,"Total"]
[null,5,6,"T",5,6,"T",5,6,"T",5,6,"T",5,6,"T",5,6,"T",5,6,null,5,6,"T",null,null,"ND I","ND II","T","ND I","ND II","T","ND I","ND II","T","ND I","ND II",null,"ND I","ND II","T",null,null,"ND I","ND II","T","ND I","ND II","T","ND I","ND II",null,"ND I","ND II","T"]
["Grales.",227,612,{"$f":"IF(SUM(B60,C60)=0,\"\",SUM(B60,C60))","v":839},202,681,{"$f":"IF(SUM(E60,F60)=0,\"\",SUM(E60,F60))","v":883},279,739,{"$f":"IF(SUM(H60,I60)=0,\"\",SUM(H60,I60))","v":1018},303,575,{"$f":"IF(SUM(K60,L60)=0,\"\",SUM(K60,L60))","v":878},234,444,{"$f":"IF(SUM(N60,O60)=0,\"\",SUM(N60,O60))","v":678},188,479,{"$f":"IF(SUM(Q60,R60)=0,\"\",SUM(Q60,R60))","v":667},{"$f":"IF(SUM(B60,E60,H60,K60,N60,Q60)=0,\"\",SUM(B60,E60,H60,K60,N60,Q60))","v":1433},{"$f":"IF(SUM(C60,F60,I60,L60,O60,R60)=0,\"\",SUM(C60,F60,I60,L60,O60,R60))","v":3530},null,882,1713,{"$f":"IF(SUM(W60,X60)=0,\"\",SUM(W60,X60))","v":2595},null,"Grales.",149,688,{"$f":"IF(SUM(AB60:AC60)=0,\"\",SUM(AB60:AC60))","v":837},116,470,{"$f":"IF(SUM(AE60:AF60)=0,\"\",SUM(AE60:AF60))","v":586},39,238,{"$f":"IF(SUM(AH60:AI60)=0,\"\",SUM(AH60:AI60))","v":277},{"$f":"IF(SUM(AB60,AE60,AH60)=0,\"\",SUM(AB60,AE60,AH60))","v":304},{"$f":"IF(SUM(AC60,AF60,AI60)=0,\"\",SUM(AC60,AF60,AI60))","v":1396},null,280,984,{"$f":"IF(SUM(AN60,AO60)=0,\"\",SUM(AN60,AO60))","v":1264},null,"Grales.",104,462,{"$f":"IF(SUM(AS60:AT60)=0,\"\",SUM(AS60:AT60))","v":566},129,489,{"$f":"IF(SUM(AV60:AW60)=0,\"\",SUM(AV60:AW60))","v":618},{"$f":"IF(SUM(AS60,AV60)=0,\"\",SUM(AS60,AV60))","v":233},{"$f":"IF(SUM(AT60,AW60)=0,\"\",SUM(AT60,AW60))","v":951},null,207,763,{"$f":"IF(SUM(BB60,BC60)=0,\"\",SUM(BB60,BC60))","v":970}]
["Técs.",192,460,{"$f":"IF(SUM(B61,C61)=0,\"\",SUM(B61,C61))","v":652},300,451,{"$f":"IF(SUM(E61,F61)=0,\"\",SUM(E61,F61))","v":751},290,604,{"$f":"IF(SUM(H61,I61)=0,\"\",SUM(H61,I61))","v":894},281,449,{"$f":"IF(SUM(K61,L61)=0,\"\",SUM(K61,L61))","v":730},237,370,{"$f":"IF(SUM(N61,O61)=0,\"\",SUM(N61,O61))","v":607},387,665,{"$f":"IF(SUM(Q61,R61)=0,\"\",SUM(Q61,R61))","v":1052},{"$f":"IF(SUM(B61,E61,H61,K61,N61,Q61)=0,\"\",SUM(B61,E61,H61,K61,N61,Q61))","v":1687},{"$f":"IF(SUM(C61,F61,I61,L61,O61,R61)=0,\"\",SUM(C61,F61,I61,L61,O61,R61))","v":2999},null,905,1450,{"$f":"IF(SUM(W61,X61)=0,\"\",SUM(W61,X61))","v":2355},null,"Técs.",148,628,{"$f":"IF(SUM(AB61:AC61)=0,\"\",SUM(AB61:AC61))","v":776},49,335,{"$f":"IF(SUM(AE61:AF61)=0,\"\",SUM(AE61:AF61))","v":384},44,193,237,{"$f":"IF(SUM(AB61,AE61,AH61)=0,\"\",SUM(AB61,AE61,AH61))","v":241},{"$f":"IF(SUM(AC61,AF61,AI61)=0,\"\",SUM(AC61,AF61,AI61))","v":1156},null,174,647,{"$f":"IF(SUM(AN61,AO61)=0,\"\",SUM(AN61,AO61))","v":821},null,"Técs.",74,326,{"$f":"IF(SUM(AS61:AT61)=0,\"\",SUM(AS61:AT61))","v":400},46,297,{"$f":"IF(SUM(AV61:AW61)=0,\"\",SUM(AV61:AW61))","v":343},{"$f":"IF(SUM(AS61,AV61)=0,\"\",SUM(AS61,AV61))","v":120},{"$f":"IF(SUM(AT61,AW61)=0,\"\",SUM(AT61,AW61))","v":623},null,107,483,{"$f":"IF(SUM(BB61,BC61)=0,\"\",SUM(BB61,BC61))","v":590}]
["Telesec.",58,187,245,92,140,232,99,167,266,92,133,225,81,165,246,62,89,151,484,881,null,206,357,563,null,"Telesec.",45,150,195,24,127,151,12,89,101,81,366,null,35,241,276,null,"Telesec.",18,198,216,20,118,138,38,316,null,20,238,258]
[null,null,null,"",null,null,"",null,null,"",null,null,"",null,null,"",null,null,"","","",null,null,null,"",null,null,null,null,"",null,null,"",null,null,"","","",null,null,null,"",null,null,null,null,"",null,null,"","","",null,null,null,""]
[null,null,null,"",null,null,"",null,null,"",null,null,"",null,null,"",null,null,"","","",null,null,null,"",null,null,null,null,"",null,null,"",null,null,"","","",null,null,null,"",null,null,null,null,"",null,null,"","","",null,null,null,""]
[null,null,null,"",null,null,"",null,null,"",null,null,"",null,null,"",null,null,"","","",null,null,null,"",null,null,null,null,"",null,null,"",null,null,"","","",null,null,null,"",null,null,null,null,"",null,null,"","","",null,null,null,""]
[null,null,null,"",null,null,"",null,null,"",null,null,"",null,null,"",null,null,"","","",null,null,null,"",null,null,null,null,"",null,null,"",null,null,"","","",null,null,null,"",null,null,null,null,"",null,null,"","","",null,null,null,""]
["Total",{"$f":"IF(SUM(B60:B66)=0,\"\",SUM(B60:B66))","v":477},{"$f":"IF(SUM(C60:C66)=0,\"\",SUM(C60:C66))","v":1259},1736,594,1272,1866,668,1510,2178,676,1157,1833,552,979,1531,637,1233,1870,{"$f":"IF(SUM(T60:T66)=0,\"\",SUM(T60:T66))","v":3604},{"$f":"IF(SUM(U60:V66)=0,\"\",SUM(U60:V66))","v":7410},null,{"$f":"IF(SUM(W60:W66)=0,\"\",SUM(W60:W66))","v":1993},{"$f":"IF(SUM(X60:X66)=0,\"\",SUM(X60:X66))","v":3520},{"$f":"IF(SUM(Y60:Y66)=0,\"\",SUM(Y60:Y66))","v":5513},null,"Total",{"$f":"IF(SUM(AB60:AB66)=0,\"\",SUM(AB60:AB66))","v":342},1466,1808,189,932,1121,95,520,615,626,2918,null,{"$f":"IF(SUM(AN60:AN66)=0,\"\",SUM(AN60:AN66))","v":489},{"$f":"IF(SUM(AO60:AO66)=0,\"\",SUM(AO60:AO66))","v":1872},{"$f":"IF(SUM(AP60:AP66)=0,\"\",SUM(AP60:AP66))","v":2361},null,"Total",{"$f":"IF(SUM(AS60:AS66)=0,\"\",SUM(AS60:AS66))","v":196},986,1182,195,904,1099,391,1890,null,{"$f":"IF(SUM(BB60:BB66)=0,\"\",SUM(BB60:BB66))","v":334},{"$f":"IF(SUM(BC60:BC66)=0,\"\",SUM(BC60:BC66))","v":1484},{"$f":"IF(SUM(BD60:BD66)=0,\"\",SUM(BD60:BD66))","v":1818}]
[]
["Nota: Para las columnas \"Alumnos con uno o mas Campos, Áreas, Clubes en riesgo de no acreditar\" se registrará el total de ALUMNOS en esta situación, se deberá anotar una sola vez, no importando la cantidad de Campos reprobados o con seis, ni las Áreas o Clubes con Niveles de Desempeño I y II."]

{"sheet":"Gráfica APROV 2 Y 3","index":3,"n_rows":12,"n_cols":16,"rows_kept":12,"cut":false,"hidden":false,"merged":[]}
[]
[null,"Español II","Segunda Lengua Inglés II","Matemáticas II","Ciencias II (Enfásis en Física)","Historia I","Formación Cívica y Ética I",null,null,null,"Español III","Segunda Lengua Inglés III","Matemáticas III","Ciencias III (Enfásis en Química)","Historia II","Formación Cívica y Ética II"]
[]
[null,"GRAFICAS PARA DESARROLLO PERSONAL",null,null,null,null,null,null,null,null,"GRAFICAS PARA DESARROLLO PERSONAL"]
[]
[null,"Artes","Tutoría y Desarrollo Socioemocional","Educación Física",null,null,null,null,null,null,"Artes","Tutoría y Desarrollo Socioemocional","Educación Física"]
[null,{"$f":"Graficas(+'APROV 2 y 3'!AB19)","v":3},{"$f":"Graficas(+'APROV 2 y 3'!AE19)","v":4},{"$f":"Graficas(+'APROV 2 y 3'!AH19)","v":4},null,null,null,null,null,null,{"$f":"Graficas(+'APROV 2 y 3'!AB55)","v":3},{"$f":"Graficas(+'APROV 2 y 3'!AE55)","v":3},{"$f":"Graficas(+'APROV 2 y 3'!AH55)","v":4}]
[]
[null,"GRAFICA PARA AUTONOMIA CURRICULAR",null,null,null,null,null,null,null,null,"GRAFICA PARA AUTONOMIA CURRICULAR"]
[]
[null,"Clubes de Necesidad","Clubes de Interés",null,null,null,null,null,null,null,"Clubes de Necesidad","Clubes de Interés"]
[null,{"$f":"Graficas(+'APROV 2 y 3'!AS19)","v":3},{"$f":"Graficas(+'APROV 2 y 3'!AV19)","v":3},null,null,null,null,null,null,null,{"$f":"Graficas(+'APROV 2 y 3'!AS55)","v":3},{"$f":"Graficas(+'APROV 2 y 3'!AV55)","v":3}]

{"sheet":"Gráfica Promedios Finales","index":4,"n_rows":11,"n_cols":4,"rows_kept":11,"cut":false,"hidden":false,"merged":[]}
[]
[]
[]
[]
[]
[]
[]
[]
[]
[null,"PROMEDIO 1RO","PROMEDIO 2DO","PROMEDIO 3ERO"]
[null,{"$f":"+'APROV 1'!X19","v":8.3000000000000007},{"$f":"+'APROV 2 y 3'!U19","v":8.1999999999999993},{"$f":"+'APROV 2 y 3'!U55","v":8.1999999999999993}]

{"sheet":"MATRICULA","index":5,"n_rows":38,"n_cols":37,"rows_kept":38,"cut":false,"hidden":false,"merged":[[6,0,6,37],[11,16,11,18],[11,19,11,21],[11,22,11,24],[24,0,27,0],[24,1,24,24],[9,0,12,0],[9,1,9,24],[10,1,10,12],[10,13,10,24],[11,1,11,3],[11,4,11,6],[11,7,11,9],[11,10,11,12],[11,13,11,15],[24,25,25,36],[25,1,25,12],[25,13,25,24],[26,1,26,3],[26,4,26,6],[26,25,26,27],[26,28,26,30],[26,31,26,33],[26,34,26,36],[26,7,26,9],[26,10,26,12],[26,13,26,15],[26,16,26,18],[26,19,26,21],[26,22,26,24],[3,0,3,36],[0,0,0,39],[1,0,1,39],[2,0,2,39],[4,0,4,39]]}
["SECRETARÍA DE EDUCACIÓN PÚBLICA DEL ESTADO DE BAJA CALIFORNIA SUR"]
["DIRECCIÓN DE EDUCACIÓN SECUNDARIA"]
["CICLO ESCOLAR 2018 - 2019"]
[]
["MATRÍCULA"]
[]
["DIRECCIÓN: EDUCACIÓN SECUNDARIA    DIRECTOR: PROFR. RUMUALDO RAMÍREZ GUTIERRÉZ     PERIODO DE EVALUACIÓN:  PRIMERO  "]
[]
[]
["Modalidad","MATRÍCULA"]
[null,"INSCRIPCIÓN INICIAL ",null,null,null,null,null,null,null,null,null,null,null,"CAMBIOS DESDE OTRAS ESCUELAS (ALTAS)"]
[null,"PRIMERO",null,null,"SEGUNDO",null,null,"TERCERO",null,null,"TOTAL",null,null,"PRIMERO",null,null,"SEGUNDO",null,null,"TERCERO",null,null,"TOTAL"]
[null,"H","M","T","H","M","T","H","M","T","H","M","T","H","M","T","H","M","T","H","M","T","H","M","T"]
["Grales.",3404,3158,{"$f":"IF(SUM(B14,C14)=0,\"\",SUM(B14,C14))","v":6562},3267,3142,{"$f":"IF(SUM(E14,F14)=0,\"\",SUM(E14,F14))","v":6409},3133,3097,{"$f":"IF(SUM(H14,I14)=0,\"\",SUM(H14,I14))","v":6230},{"$f":"IF(SUM(B14,E14,H14)=0,\"\",SUM(B14,E14,H14))","v":9804},{"$f":"IF(SUM(C14,F14,I14)=0,\"\",SUM(SUM(C14,F14,I14)))","v":9397},{"$f":"IF(SUM(K14,L14)=0,\"\",SUM(K14,L14))","v":19201},15,18,{"$f":"IF(SUM(N14,O14)=0,\"\",SUM(N14,O14))","v":33},25,13,{"$f":"IF(SUM(Q14,R14)=0,\"\",SUM(Q14,R14))","v":38},19,21,{"$f":"IF(SUM(T14,U14)=0,\"\",SUM(T14,U14))","v":40},{"$f":"IF(SUM(N14,Q14,T14)=0,\"\",SUM(N14,Q14,T14))","v":59},{"$f":"IF(SUM(O14,R14,U14)=0,\"\",SUM(SUM(O14,R14,U14)))","v":52},{"$f":"IF(SUM(W14,X14)=0,\"\",SUM(W14,X14))","v":111}]
["Técs.",2533,2570,{"$f":"IF(SUM(B15,C15)=0,\"\",SUM(B15,C15))","v":5103},2537,2460,{"$f":"IF(SUM(E15,F15)=0,\"\",SUM(E15,F15))","v":4997},2529,2371,{"$f":"IF(SUM(H15,I15)=0,\"\",SUM(H15,I15))","v":4900},{"$f":"IF(SUM(B15,E15,H15)=0,\"\",SUM(B15,E15,H15))","v":7599},{"$f":"IF(SUM(C15,F15,I15)=0,\"\",SUM(SUM(C15,F15,I15)))","v":7401},{"$f":"IF(SUM(K15,L15)=0,\"\",SUM(K15,L15))","v":15000},21,16,{"$f":"IF(SUM(N15,O15)=0,\"\",SUM(N15,O15))","v":37},18,24,{"$f":"IF(SUM(Q15,R15)=0,\"\",SUM(Q15,R15))","v":42},11,22,{"$f":"IF(SUM(T15,U15)=0,\"\",SUM(T15,U15))","v":33},{"$f":"IF(SUM(N15,Q15,T15)=0,\"\",SUM(N15,Q15,T15))","v":50},{"$f":"IF(SUM(O15,R15,U15)=0,\"\",SUM(SUM(O15,R15,U15)))","v":62},{"$f":"IF(SUM(W15,X15)=0,\"\",SUM(W15,X15))","v":112}]
["Telesec.",796,723,1519,706,693,1399,741,671,1412,2243,2087,4330,14,7,21,7,6,13,9,7,16,30,20,50]
[null,null,null,"",null,null,"",null,null,"","","","",null,null,"",null,null,"",null,null,"","","",""]
[null,null,null,"",null,null,"",null,null,"","","","",null,null,"",null,null,"",null,null,"","","",""]
[null,null,null,"",null,null,"",null,null,"","","","",null,null,"",null,null,"",null,null,"","","",""]
[null,null,null,"",null,null,"",null,null,"","","","",null,null,"",null,null,"",null,null,"","","",""]
[null,null,null,"",null,null,"",null,null,"","","","",null,null,"",null,null,"",null,null,"","","",""]
[null,null,null,"",null,null,"",null,null,"","","","",null,null,"",null,null,"",null,null,"","","",""]
["TOTAL",{"$f":"SUM(B14:B22)","v":6733},6451,13184,6510,6295,12805,6403,6139,12542,19646,18885,38531,50,41,91,50,43,93,39,50,89,139,134,273]
[]
["Modalidad","BAJAS",null,null,null,null,null,null,null,null,null,null,null,null,null,null,null,null,null,null,null,null,null,null,null,"EXISTENCIA"]
[null,"DESERCIÓN",null,null,null,null,null,null,null,null,null,null,null,"CAMBIOS HACIA OTRAS ESCUELAS (TRASLADOS)"]
[null,"PRIMERO",null,null,"SEGUNDO",null,null,"TERCERO",null,null,"TOTAL",null,null,"PRIMERO",null,null,"SEGUNDO",null,null,"TERCERO",null,null,"TOTAL",null,null,"PRIMERO",null,null,"SEGUNDO",null,null,"TERCERO",null,null,"TOTAL"]
[null,"H","M","T","H","M","T","H","M","T","H","M","T","H","M","T","H","M","T","H","M","T","H","M","T","H","M","T","H","M","T","H","M","T","H","M","T"]
["Grales.",2,5,{"$f":"IF(SUM(B29,C29)=0,\"\",SUM(B29,C29))","v":7},7,3,{"$f":"IF(SUM(E29,F29)=0,\"\",SUM(E29,F29))","v":10},7,5,{"$f":"IF(SUM(H29,I29)=0,\"\",SUM(H29,I29))","v":12},{"$f":"IF(SUM(B29,E29,H29)=0,\"\",SUM(B29,E29,H29))","v":16},{"$f":"IF(SUM(C29,F29,I29)=0,\"\",SUM(SUM(C29,F29,I29)))","v":13},{"$f":"IF(SUM(K29,L29)=0,\"\",SUM(K29,L29))","v":29},40,13,{"$f":"IF(SUM(N29,O29)=0,\"\",SUM(N29,O29))","v":53},26,33,{"$f":"IF(SUM(Q29,R29)=0,\"\",SUM(Q29,R29))","v":59},29,23,{"$f":"IF(SUM(T29,U29)=0,\"\",SUM(T29,U29))","v":52},{"$f":"IF(SUM(N29,Q29,T29)=0,\"\",SUM(N29,Q29,T29))","v":95},{"$f":"IF(SUM(O29,R29,U29)=0,\"\",SUM(SUM(O29,R29,U29)))","v":69},{"$f":"IF(SUM(W29,X29)=0,\"\",SUM(W29,X29))","v":164},3377,3158,{"$f":"IF(SUM(Z29,AA29)=0,\"\",SUM(Z29,AA29))","v":6535},3259,3119,{"$f":"IF(SUM(AC29,AD29)=0,\"\",SUM(AC29,AD29))","v":6378},3116,3090,{"$f":"IF(SUM(AF29,AG29)=0,\"\",SUM(AF29,AG29))","v":6206},{"$f":"IF(SUM(Z29,AC29,AF29)=0,\"\",SUM(Z29,AC29,AF29))","v":9752},{"$f":"IF(SUM(AA29,AD29,AG29)=0,\"\",SUM(SUM(AA29,AD29,AG29)))","v":9367},{"$f":"IF(SUM(AI29,AJ29)=0,\"\",SUM(AI29,AJ29))","v":19119}]
["Técs.",6,4,{"$f":"IF(SUM(B30,C30)=0,\"\",SUM(B30,C30))","v":10},5,5,{"$f":"IF(SUM(E30,F30)=0,\"\",SUM(E30,F30))","v":10},2,3,{"$f":"IF(SUM(H30,I30)=0,\"\",SUM(H30,I30))","v":5},{"$f":"IF(SUM(B30,E30,H30)=0,\"\",SUM(B30,E30,H30))","v":13},{"$f":"IF(SUM(C30,F30,I30)=0,\"\",SUM(SUM(C30,F30,I30)))","v":12},{"$f":"IF(SUM(K30,L30)=0,\"\",SUM(K30,L30))","v":25},36,24,{"$f":"IF(SUM(N30,O30)=0,\"\",SUM(N30,O30))","v":60},24,25,{"$f":"IF(SUM(Q30,R30)=0,\"\",SUM(Q30,R30))","v":49},21,19,{"$f":"IF(SUM(T30,U30)=0,\"\",SUM(T30,U30))","v":40},{"$f":"IF(SUM(N30,Q30,T30)=0,\"\",SUM(N30,Q30,T30))","v":81},{"$f":"IF(SUM(O30,R30,U30)=0,\"\",SUM(SUM(O30,R30,U30)))","v":68},{"$f":"IF(SUM(W30,X30)=0,\"\",SUM(W30,X30))","v":149},2512,2558,{"$f":"IF(SUM(Z30,AA30)=0,\"\",SUM(Z30,AA30))","v":5070},2526,2454,{"$f":"IF(SUM(AC30,AD30)=0,\"\",SUM(AC30,AD30))","v":4980},2517,2371,{"$f":"IF(SUM(AF30,AG30)=0,\"\",SUM(AF30,AG30))","v":4888},{"$f":"IF(SUM(Z30,AC30,AF30)=0,\"\",SUM(Z30,AC30,AF30))","v":7555},{"$f":"IF(SUM(AA30,AD30,AG30)=0,\"\",SUM(SUM(AA30,AD30,AG30)))","v":7383},{"$f":"IF(SUM(AI30,AJ30)=0,\"\",SUM(AI30,AJ30))","v":14938}]
["Telesec.",2,2,4,2,3,5,5,0,5,9,5,14,8,6,14,7,8,15,6,6,12,21,20,41,800,722,1522,704,688,1392,739,672,1411,2243,2082,4325]
[null,null,null,"",null,null,"",null,null,"","","","",null,null,"",null,null,"",null,null,"","","","",null,null,"",null,null,"",null,null,"","","",""]
[null,null,null,"",null,null,"",null,null,"","","","",null,null,"",null,null,"",null,null,"","","","",null,null,"",null,null,"",null,null,"","","",""]
[null,null,null,"",null,null,"",null,null,"","","","",null,null,"",null,null,"",null,null,"","","","",null,null,"",null,null,"",null,null,"","","",""]
[null,null,null,"",null,null,"",null,null,"","","","",null,null,"",null,null,"",null,null,"","","","",null,null,"",null,null,"",null,null,"","","",""]
[null,null,null,"",null,null,"",null,null,"","","","",null,null,"",null,null,"",null,null,"","","","",null,null,"",null,null,"",null,null,"","","",""]
[null,null,null,"",null,null,"",null,null,"","","","",null,null,"",null,null,"",null,null,"","","","",null,null,"",null,null,"",null,null,"","","",""]
["TOTAL",{"$f":"SUM(B29:B37)","v":10},11,21,14,11,25,14,8,22,38,30,68,84,43,127,57,66,123,56,48,104,197,157,354,{"$f":"SUM(B23,N23-B38-N38)","v":6689},6438,{"$f":"SUM(AB29:AB37)","v":13127},{"$f":"SUM(E23,Q23-E38-Q38)","v":6489},6261,12750,{"$f":"SUM(H23,T23-H38-T38)","v":6372},6133,12505,19550,18832,38382]

{"sheet":"NORMALIDAD MÍNIMA","index":6,"n_rows":34,"n_cols":18,"rows_kept":34,"cut":false,"hidden":false,"merged":[[33,2,33,10],[12,1,13,1],[22,1,22,2],[23,1,23,2],[24,1,24,2],[25,1,25,2],[30,2,30,10],[27,2,27,4],[12,9,12,11],[30,11,30,16],[31,2,31,10],[31,11,31,16],[32,2,32,10],[32,11,32,16],[27,11,27,16],[28,2,28,10],[28,11,28,16],[29,2,29,10],[29,11,29,16],[12,12,12,13],[12,14,12,15],[20,1,21,2],[20,3,20,5],[20,6,20,8],[20,9,21,9],[20,10,20,12],[20,13,20,14],[20,15,20,16],[12,2,17,4],[12,5,12,7],[12,8,13,8],[11,1,11,17],[5,1,6,1],[5,2,5,4],[5,5,5,7],[5,8,6,8],[5,9,5,11],[5,12,5,13],[5,14,5,15],[0,1,0,17],[1,1,1,17],[2,1,2,17],[3,1,3,17],[4,2,4,17]]}
[null,"SECRETARÍA DE EDUCACIÓN PÚBLICA DEL ESTADO DE BAJA CALIFORNIA SUR"]
[null,"DIRECCIÓN DE EDUCACIÓN SECUNDARIA"]
[null,"CICLO ESCOLAR 2018 - 2019"]
[null,"CONCENTRADO NORMALIDAD MÍNIMA"]
[null,null,"DIRECCIÓN: EDUCACIÓN SECUNDARIA    DIRECTOR: PROFR. RUMUALDO RAMÍREZ GUTIERRÉZ     PERIODO DE EVALUACIÓN:  PRIMERO  "]
[null,"Modalidad","DIRECTIVOS",null,null,"COORDINADORES",null,null,"R","INASISTENCIAS",null,null,"LICENCIAS ECONÓMICAS",null,"LICENCIAS MÉDICAS",null,"TOTAL DE DÍAS NO LABORADOS"]
[null,null,"H","M","T","H","M","T",null,"I ","P.D.","D.N.L.I y P.D.","L.E."," D.N.L.E.","L.M.","D.N.L.M.","DNLI y PD, DNLE, DNLM"]
[null,"Grales.",61,64,{"$f":"IF(SUM(C8,D8)=0,\"\",SUM(C8,D8))","v":125},33,33,{"$f":"IF(SUM(F8,G8)=0,\"\",SUM(F8,G8))","v":66},4,38,29,{"$f":"IF(SUM(J8,K8)=0,\"\",SUM(J8,K8))","v":67},66,373,36,211,{"$f":"IF(SUM(L8,N8,P8)=0,\"0\",SUM(L8,N8,P8))","v":651}]
[null,"Técs.",36,23,{"$f":"IF(SUM(C9,D9)=0,\"\",SUM(C9,D9))","v":59},41,25,{"$f":"IF(SUM(F9,G9)=0,\"\",SUM(F9,G9))","v":66},7,8,12,20,34,105,16,71,{"$f":"IF(SUM(L9,N9,P9)=0,\"0\",SUM(L9,N9,P9))","v":196}]
[null,"Telesec.",24,9,{"$f":"IF(SUM(C10,D10)=0,\"\",SUM(C10,D10))","v":33},148,106,254,0,0,0,0,0,0,0,0,"0"]
[null,"Total",{"$f":"SUM(C8:C10)","v":121},96,217,222,164,386,11,46,41,87,100,478,52,282,847]
[]
[null,"Modalidad","PERSONAL  POR HORAS ",null,null,"DOCENTES",null,null,"R","INASISTENCIAS",null,null,"LICENCIAS ECONÓMICAS",null,"LICENCIAS MÉDICAS",null,"TOTAL DE HORAS NO LABORADOS"]
[null,null,null,null,null,"H","M","T",null,"I ","P.D.","H.N.L.I y P.D.","L.E."," H.N.L.E.","L.M.","H.N.L.M.","HNLI y PD, HNLE, HNLM"]
[null,"Grales.",null,null,null,642,707,{"$f":"IF(SUM(F15,G15)=0,\"\",SUM(F15,G15))","v":1349},492,1415,376,{"$f":"IF(SUM(J15,K15)=0,\"\",SUM(J15,K15))","v":1791},594,5432,475,6580,{"$f":"IF(SUM(L15,N15,P15)=0,\"0\",SUM(L15,N15,P15))","v":13803}]
[null,"Técs.",null,null,null,311,371,682,222,286,173,459,388,3302,227,4266,8027]
[null,"Telesec.",null,null,null,148,106,254,0,1,0,1,60,180,20,218,399]
[null,"Total",null,null,null,{"$f":"SUM(F15:F17)","v":1101},1184,2285,714,1702,549,2251,1042,8914,722,11064,22229]
[]
[]
[null,"Modalidad",null,"ASISTENCIA EDUCATIVA",null,null,"ADMINISTRATIVO Y DE APOYO",null,null,"R","INASISTENCIAS",null,null,"LICENCIAS ECONÓMICAS",null,"LICENCIAS MÉDICAS",null,"TOTAL DE DÍAS NO LABORADOS"]
[null,null,null,"H","M","T","H","M","T",null,"I ","P.D.","D.N.L.I y P.D.","L.E."," D.N.L.E.","L.M.","D.N.L.M.","DNLI y PD, DNLE, DNLM"]
[null,"Grales.",null,80,173,{"$f":"IF(SUM(D23,E23)=0,\"\",SUM(D23,E23))","v":253},234,305,{"$f":"IF(SUM(G23,H23)=0,\"\",SUM(G23,H23))","v":539},210,222,166,{"$f":"IF(SUM(K23,L23)=0,\"\",SUM(K23,L23))","v":388},330,883,183,1507,{"$f":"IF(SUM(M23,O23,Q23)=0,\"0\",SUM(M23,O23,Q23))","v":2778}]
[null,"Técs.",null,80,95,175,141,158,299,96,77,45,122,237,616,141,614,1352]
[null,"Telesec.",null,0,0,0,61,51,112,0,6,11,17,50,150,22,87,254]
[null,"Total",null,{"$f":"SUM(D23:D25)","v":160},268,428,436,514,950,306,305,222,527,617,1649,346,2208,4384]
[]
[null,null,"NOTA:",null,null,null,null,null,null,null,null,"NOTA:"]
[null,null,"I.: INASISTENCIAS",null,null,null,null,null,null,null,null,"H.N.L.E.: HORAS NO LABORADOS POR LICENCIAS ECONÓMICAS"]
[null,null,"H.N.L.I.: HORAS NO LABORADAS POR INASISTENCIAS",null,null,null,null,null,null,null,null,"D.N.L.E.:  DÍAS NO LABORADOS POR LICENCIAS ECONÓMICAS"]
[null,null,"D.N.L.I.: DÍAS NO LABORADOS POR INASISTENCIAS",null,null,null,null,null,null,null,null,"L.M.: PERSONAS QUE PRESENTARON LICENCIAS MÉDICAS"]
[null,null,"R. :  CANTIDAD DE RETARDOS",null,null,null,null,null,null,null,null,"H.N.L.M.: HORAS NO LABORADAS POR LICENCIAS MÉDICAS"]
[null,null,"L.E.:   PERSONAL QUE SOLICITÓ LICENCIAS ECONÓMICAS",null,null,null,null,null,null,null,null,"D.N.L.M.: DÍAS NO LABORADOS POR LICENCIAS MÉDICAS"]
[null,null,"P.D.: PERMISOS DIRECCIÓN"]